{"text_format":"1","workbook":"xlsx","n_sheets":8,"sheets":["How to start","Full Code","Level A","Level AB","Level ABC (full code)","Selecting Codes","Error Precursors(Area-Element)","Error Precursor Selections"],"not_rendered":{"charts":0,"images":3,"macros":1,"external_links":0,"defined_names":124,"comments":1,"pivot_tables":0},"unopened":[],"bounds":{"document_bytes":16777216,"sheet_cells":100000,"rows_first":2000,"rows_last":500,"rows_between":2000,"halvings":0,"cell_chars":16384,"cell_head_chars":4096},"cells_cut":0,"cells_raw":0,"read":"whole","date_system":"1900"}

{"sheet":"How to start","index":0,"n_rows":0,"n_cols":0,"rows_kept":0,"cut":false,"hidden":true,"merged":[]}

{"sheet":"Full Code","index":1,"n_rows":249,"n_cols":3,"rows_kept":249,"cut":false,"hidden":false,"merged":[]}
["Code","Verbal Description","Definition"]
["A1","Design/Engineering Problem ","An event or condition that can be traced to a defect in design or other factors related to configuration, engineering, layout, tolerances, calculations, etc.  Note: even though Engineering is explicitly only in the branch title, its use throughout this branch is implicit.  Also, it is Engineering as a function or process, not as a job title. "]
["A1B1","DESIGN INPUT LTA ","Input to a design that was lacking adequate information that was necessary for the design. "]
["A1B1C01","- Design input cannot be met","The criteria and other requirements were so stringent that they could not be met. There were conflicting criteria. Not all of the necessary references were included"]
["A1B1C02","- Design input obsolete","The criteria were out-of-date. An old version of a requirement or specification was used. Process requirements/conditions changed and the changes were omitted from the input. "]
["A1B1C03","- Design input not correct","The wrong standards or requirements were used. The requirements were transcribed in error"]
["A1B1C04","- Necessary design input not available","The necessary requirements, codes, standards, etc. were not available to the designer"]
["A1B2","DESIGN OUTPUT LTA","Inadequate design output that did not meet the customer’s expectations or design requirements"]
["A1B2C01","- Design output scope LTA","The design did not consider all the possible scenarios. All the operating conditions, [normal and emergency] were not included in the design"]
["A1B2C02","- Design output not clear","The drawings were difficult to read. The specifications were difficult to understand. The specification could be interpreted in more than one way. "]
["A1B2C03","- Design output not correct","The drawings and other specifications were incorrect. The final design output did not include all changes. "]
["A1B2C04","- Inconsistent design output","There were differences between different output documents. The drawings and other design documents did not agree."]
["A1B2C05","- Design input not addressed in Design output","The specifications did not include all the requirements. Some criteria were left out of the design output. "]
["A1B2C06","– Drawing, specification or data error","The latest drawing revision was not referenced. The latest vendor information was not included in the design documentation. The correct data was not noted on the design documentation request. "]
["A1B2C07","- Error in equipment or material selection","The correct vendor identification number was not used for procurement of equipment. The correct grade of stainless steel was not specified for the material. Error in equipment selection to obtain a desired affect."]
{"$rows_left_out":235}
{"sheet":"Level A","index":2,"n_rows":12,"n_cols":4,"rows_kept":12,"cut":false,"hidden":false,"merged":[]}
["Code","Verbal Description","Code","Definition"]
["A1","Design/Engineering","A1","An event or condition that can be traced to a defect in design or other factors related to configuration, engineering, layout, tolerances, calculations, etc.  Note: even though Engineering is explicitly only in the branch title, its use throughout this branch is implicit.  Also, it is Engineering as a function or process, not as a job title. "]
["A2","Equipment/Material","A2","Is defined as an event or condition resulting from the failure, malfunction, or deterioration of equipment or parts, including instruments or material. "]
["A3","Individual Human Performance","A3","An event or condition resulting from the failure, malfunction, or deterioration of the human performance associated with the process. Note: Strictly speaking, A3B1, A3B2, & A3B3 nodes are only applicable when “problem-solving,” although this does not have to be conscious. These are not the intended coding when not engaged in solving a problem, e.g., falling asleep because of prescription medication [which might be A3B4C01 or A5B4C06]. Further, these codes are for individual actions or lack thereof. If an event has multiple occurrences of the same A3 C node[s], it is time to look for other rationale behind the behavior. Yes, there are single examples of group performance that is LTA. However, when it is multiple examples, there is usually another explanation. For example, the control room operators at Three Mile Island mutually incorrectly diagnosed several of the accident indications and also mutually avoided application of several potential recovery paths. These errors were eventually traced to how their training had treated these potentialities. "]
["A4","Management / Organization","A4","An event or condition that could be directly traced to managerial actions or methodology (or lack thereof). A management problem attributed to management methods (directions, monitoring, assessment, accountability, and corrective action), inadequate resource allocation, work organization and planning, supervisory methods, and change management practices. \nNote: Apparent Cause Corrective Actions for this branch in particular easily slip into correcting the program as opposed to the implementation. Fixing the program is the realm of root causes. The analyst is cautioned to gauge Corrective Actions appropriately. Also, even though the terms “Management” and “Organization” are used in the title, use of either one separately implies the other, and neither is intended as a job title, solely as a function or process.\n"]
["A5","Communications","A5","Inadequate presentation or exchange of information. Note: “Communications” is defined as the act of exchanging information. Persons on all sides of a communication link should be questioned regarding known or suspected problems. "]
["A6","Training","A6","An event or condition that could be traced to a lack of training or insufficient training to enable a person to perform a desired task adequately. Note: A training deficiency is usually exposed by a human error, so the use of this branch of the CAT is often coupled with A3B2 or A3B3. "]
["A7","Other","A7","The problem was caused by factors beyond the control of the organization, legacy radiological or hazardous material."]
["A8","(Open)","A8","Situations where system operating practices result in situations and corrective actions to be taken"]
["AN","No Causes found","AN","No cause codes can be attributed to this Entity; designed to be used where the overall event being evaluated involved multiple entities, and some of the entities were found to not be a contributor to the event"]
["AX","Overall Configuration","AX","Situations where switch positions, mechanical component positions, or software settings are found to be incorrect, resulting in undesirable actual or potential results."]
["AZ","Information to determine cause LTA","AZ","Where the information provided is not sufficient to determine a cause, or where the event was intended (no cause exists) - for removing this event from the queue of events to be reviewed"]

{"sheet":"Level AB","index":3,"n_rows":39,"n_cols":4,"rows_kept":39,"cut":false,"hidden":false,"merged":[]}
["Code","Verbal Description","Code","Definition"]
["A1B1","DESIGN INPUT LTA ",{"$f":"A2","v":"A1B1"},"Input to a design that was lacking adequate information that was necessary for the design. "]
["A1B2","DESIGN OUTPUT LTA",{"$f":"A3","v":"A1B2"},"Inadequate design output that did not meet the customer’s expectations or design requirements"]
["A1B3","DESIGN/DOCUMENTATION LTA","A1B3","Design or documentation that did not include all of the required information and did not comply with document control and record requirements"]
["A1B4","DESIGN/INSTALLATION VERIFICATION LTA","A1B4","Design reviews, testing, independent inspections, and acceptance were not in compliance with customer expectations and/or site requirements"]
["A1B5","OPERABILITY OF DESIGN/ENVIRONMENT LTA ","A1B5","Personnel or environmental factors were not considered as part of the design"]
["A2B1","CALIBRATION FOR INSTRUMENTS LTA","A2B1","Calibrations did not include all the essential elements. Equipment as-found condition was less than adequate. "]
["A2B2","PERIODIC/CORRECTIVE MAINTENANCE LTA","A2B2","Periodic maintenance was not established for the equipment, instrument or component. The periodic maintenance was inadequate. Corrective maintenance was inadequate to correct the problem. Equipment history did not exist for the instrument or component. The equipment history was incomplete. "]
["A2B3","INSPECTION/TESTING LTA","A2B3","Scheduled inspection/testing did not exist for the instrument or equipment. The inspection/testing was inadequate or not performed as required. The inspection/testing did not include all the essential elements. Note: A1B4 should be used for Design Testing. "]
["A2B4","MATERIAL CONTROL LTA","A2B4","The problem was due to the inadequate handling, storage, packaging or shipping of materials or equipment. The shelf life for material was exceeded. An unauthorized material or equipment substitution was made. Spare parts were inadequately stored. There was an error made in the labeling or marking. "]
["A2B5","PROCUREMENT CONTROL LTA","A2B5","The error was due to inadequate control of changes to procurement specifications or purchase orders. A fabricated item failed to meet requirements or an incorrect item was received. Product acceptance requirements failed to match design requirements or were otherwise unacceptable. Note: This is only for equipment and materials, procured services are addressed in A4B2C10. "]
["A2B6","DEFECTIVE, FAILED OR CONTAMINATED","A2B6","An event was caused by a failed or defective part. The material used was defective or flawed. The weld, braze or soldered joint was defective. The component reached the end of its expected service life. There was electrical or instrument noise interference or interaction. Foreign material or contaminant caused the equipment or component to fail. "]
["A2B7","EQUIPMENT INTERACTIONS LTA","A2B7","An event was caused by less than adequate interaction between two or more pieces of equipment within a larger system. These interactions are required or are essential for the proper operation of the system and usually do not require human intervention.  "]
["A3B1","SKILL BASED ERROR","A3B1","Inattention or over-attention to performance of work affected the event. "]
["A3B2","RULE BASED ERROR","A3B2","A misapplication of a good rule for behavior or application of a bad rule applied for behavior during the work process impacted the event. Note: application of this node is not limited to misapplication of procedures. Rules are often mental rather than written. "]
{"$rows_left_out":25}
{"sheet":"Level ABC (full code)","index":4,"n_rows":189,"n_cols":4,"rows_kept":189,"cut":false,"hidden":false,"merged":[]}
["Code","Verbal Description","Code","Definition"]
["A1B1C01","- Design input cannot be met",{"$f":"A2","v":"A1B1C01"},"The criteria and other requirements were so stringent that they could not be met. There were conflicting criteria. Not all of the necessary references were included"]
["A1B1C02","- Design input obsolete",{"$f":"A3","v":"A1B1C02"},"The criteria were out-of-date. An old version of a requirement or specification was used. Process requirements/conditions changed and the changes were omitted from the input. "]
["A1B1C03","- Design input not correct","A1B1C03","The wrong standards or requirements were used. The requirements were transcribed in error"]
["A1B1C04","- Necessary design input not available","A1B1C04","The necessary requirements, codes, standards, etc. were not available to the designer"]
["A1B2C01","- Design output scope LTA","A1B2C01","The design did not consider all the possible scenarios. All the operating conditions, [normal and emergency] were not included in the design"]
["A1B2C02","- Design output not clear","A1B2C02","The drawings were difficult to read. The specifications were difficult to understand. The specification could be interpreted in more than one way. "]
["A1B2C03","- Design output not correct","A1B2C03","The drawings and other specifications were incorrect. The final design output did not include all changes. "]
["A1B2C04","- Inconsistent design output","A1B2C04","There were differences between different output documents. The drawings and other design documents did not agree."]
["A1B2C05","- Design input not addressed in design output","A1B2C05","The specifications did not include all the requirements. Some criteria were left out of the design output. "]
["A1B2C06","– Drawing, specification or data error","A1B2C06","The latest drawing revision was not referenced. The latest vendor information was not included in the design documentation. The correct data was not noted on the design documentation request. "]
["A1B2C07","- Error in equipment or material selection","A1B2C07","The correct vendor identification number was not used for procurement of equipment. The correct grade of stainless steel was not specified for the material. "]
["A1B2C08","- Errors not detectable","A1B2C08","Personnel were unable to detect errors [by way of alarms or instrument readings] during or after the occurrence. A serious error went unnoticed because there was no way to monitor system status."]
["A1B2C09","– Errors not recoverable","A1B2C09","The system was designed such that personnel were unable to recover from error discovered before a failure occurred. "]
["A1B3C01","– Design / documentation not complete","A1B3C01","The designs and other documentation for equipment were incomplete. Items were missing from the documentation. A complete baseline did not exist. "]
{"$rows_left_out":175}
{"sheet":"Selecting Codes","index":5,"n_rows":8,"n_cols":6,"rows_kept":8,"cut":false,"hidden":false,"merged":[[0,1,0,5],[1,1,1,5],[2,1,2,5]]}
[null,"1.  Select the appropriate grouping of the Level A Descriptions"]
[null,"2.  After selecting a Level A description, you then pick the appropriate Level B description.  IF NOT selected, the block will show any previous selections, which may not be correct!"]
[null,"3. Once Level A and Level B selections are made, select the appropriate Level C description.  IF NOT selected, the block will show any previous selections, which may not be correct!"]
["Pick the Level A Code Description","Level A Code selected is ",null,"Level B Code Selected is",null,"Level C Code Selected is"]
["Equipment/Material",{"$f":"VLOOKUP(Information_to_determine_cause_LTA,'Level A'!$B$2:$C$12,2,FALSE)","v":"A2"},"CALIBRATION FOR INSTRUMENTS LTA",{"$f":"IF(C5=\"\",\"\",VLOOKUP(C5,'Level AB'!$B$2:$D$39,2,FALSE))","v":"A2B1"},"- Coordinated tuning or adjustments of instrumentation LTA",{"$f":"IF(E5=\"\",\"\",VLOOKUP(E5,'Level ABC (full code)'!$B$2:$D$189,2,FALSE))","v":"A2B1C03"}]
[]
["Defined as:",null,"Defined as:",null,"Defined as:"]
[{"$f":"IF(A5=\"\",\"\",VLOOKUP(A5,'Level A'!$B$2:$D$12,3,FALSE))","v":"Is defined as an event or condition resulting from the failure, malfunction, or deterioration of equipment or parts, including instruments or material. "},null,{"$f":"IF(C5=\"\",\"\",VLOOKUP(C5,'Level AB'!$B$2:$D$39,3,FALSE))","v":"Calibrations did not include all the essential elements. Equipment as-found condition was less than adequate. "},null,{"$f":"IF(E5=\"\",\"\",VLOOKUP(E5,'Level ABC (full code)'!$B$2:$D$189,3,FALSE))","v":"An event occurred as a result of multiple pieces of controls for equipment or instrumentation, where adjustment of one requires the coordinated adjustment(s) of others did not occur, or was performed incorrectly."}]

{"sheet":"Error Precursors(Area-Element)","index":6,"n_rows":164,"n_cols":5,"rows_kept":164,"cut":false,"hidden":true,"merged":[]}
["Error Precursor Area","Element","Code","LevelC_Code_Description","LevelC_Code_Definition"]
["Task Demands","High workload [memory requirements]","A4B4C07",{"$f":"VLOOKUP($C2,'Full Code'!$A$2:$B$221,2,FALSE)","v":"- Too many concurrent tasks assigned to worker"},{"$f":"VLOOKUP($C2,'Full Code'!$A$2:$C$221,3,FALSE)","v":"Supervision failed to detect that concurrent job assignments for an individual exceeded the individual's abilities. "}]
["Task Demands","High workload [memory requirements]","A5B2C05",{"$f":"VLOOKUP(C3,'Full Code'!$A$2:$B$221,2,FALSE)","v":"- Ambiguous instructions / requirements"},{"$f":"VLOOKUP($C3,'Full Code'!$A$2:$C$221,3,FALSE)","v":"The instructions in the written communication were unclear, uncertain, or interpretable in more than one way.  Different procedures related to the same task contained different requirements. There were conflicting or inconsistent requirements stated in different steps of the same procedure. Requirements were stated in different units. "}]
["Task Demands","High workload [memory requirements]","A5B2C08",{"$f":"VLOOKUP(C4,'Full Code'!$A$2:$B$221,2,FALSE)","v":"– Incomplete / situation not covered"},{"$f":"VLOOKUP($C4,'Full Code'!$A$2:$C$221,3,FALSE)","v":"Details of the written communication were incomplete.  Insufficient information was presented.  The written communication did not address situations likely to occur during the completion of the procedure.  Note: This is for information that is not in the written communication.  A5B2C07 is for information that is in the document. "}]
["Task Demands","Time pressure [in a hurry]","A4B3C02",{"$f":"VLOOKUP(C5,'Full Code'!$A$2:$B$221,2,FALSE)","v":"- Insufficient time allotted for task"},{"$f":"VLOOKUP($C5,'Full Code'!$A$2:$C$221,3,FALSE)","v":"Scheduled duration of the task did not adequately address known conditions or account for reasonable emergent issues. "}]
["Task Demands","Time pressure [in a hurry]","A4B3C07",{"$f":"VLOOKUP(C6,'Full Code'!$A$2:$B$221,2,FALSE)","v":"- Job scoping did not identify potential task interruptions and/or environmental stress"},{"$f":"VLOOKUP($C6,'Full Code'!$A$2:$C$221,3,FALSE)","v":"The work scoping process was not effective in detecting reasonable obstructions to work flow (e.g., shift changes) or the impact of environmental conditions.   Note: This code applies to disruptions of circadian rhythms [biological functions based on 24-hour schedule] caused by scheduling of work. "}]
["Task Demands","Simultaneous, multiple tasks","A4B3C07",{"$f":"VLOOKUP(C7,'Full Code'!$A$2:$B$221,2,FALSE)","v":"- Job scoping did not identify potential task interruptions and/or environmental stress"},{"$f":"VLOOKUP($C7,'Full Code'!$A$2:$C$221,3,FALSE)","v":"The work scoping process was not effective in detecting reasonable obstructions to work flow (e.g., shift changes) or the impact of environmental conditions.   Note: This code applies to disruptions of circadian rhythms [biological functions based on 24-hour schedule] caused by scheduling of work. "}]
["Task Demands","Simultaneous, multiple tasks","A4B4C07",{"$f":"VLOOKUP(C8,'Full Code'!$A$2:$B$221,2,FALSE)","v":"- Too many concurrent tasks assigned to worker"},{"$f":"VLOOKUP($C8,'Full Code'!$A$2:$C$221,3,FALSE)","v":"Supervision failed to detect that concurrent job assignments for an individual exceeded the individual's abilities. "}]
["Task Demands","Repetitive action/monotony","A4B3C07",{"$f":"VLOOKUP(C9,'Full Code'!$A$2:$B$221,2,FALSE)","v":"- Job scoping did not identify potential task interruptions and/or environmental stress"},{"$f":"VLOOKUP($C9,'Full Code'!$A$2:$C$221,3,FALSE)","v":"The work scoping process was not effective in detecting reasonable obstructions to work flow (e.g., shift changes) or the impact of environmental conditions.   Note: This code applies to disruptions of circadian rhythms [biological functions based on 24-hour schedule] caused by scheduling of work. "}]
["Task Demands","Repetitive action/monotony","A4B3C10",{"$f":"VLOOKUP(C10,'Full Code'!$A$2:$B$221,2,FALSE)","v":"– Problem performing repetitive tasks and/or subtasks"},{"$f":"VLOOKUP($C10,'Full Code'!$A$2:$C$221,3,FALSE)","v":"The work flow plan repeated tasks or subtasks to the detriment of successful completion of the evolution. "}]
["Task Demands","Irrecoverable actions","A1B2C09",{"$f":"VLOOKUP(C11,'Full Code'!$A$2:$B$221,2,FALSE)","v":"– Errors not recoverable"},{"$f":"VLOOKUP($C11,'Full Code'!$A$2:$C$221,3,FALSE)","v":"The system was designed such that personnel were unable to recover from error discovered before a failure occurred. "}]
["Task Demands","Interpretation requirements","A1B5C01",{"$f":"VLOOKUP(C12,'Full Code'!$A$2:$B$221,2,FALSE)","v":"- Ergonomics LTA"},{"$f":"VLOOKUP($C12,'Full Code'!$A$2:$C$221,3,FALSE)","v":"Inadequate ergonomic design contributed to the occurrence. - The operator was physically incapable of performing the required task.  The operator had to go too far to respond to the alarm.  Personnel mobility or vision was restricted.  An individual had difficulty reaching the equipment or assumed an awkward position to complete a task.  The event was caused because illumination levels were not sufficient for task performance. "}]
["Task Demands","Interpretation requirements","A1B5C02",{"$f":"VLOOKUP(C13,'Full Code'!$A$2:$B$221,2,FALSE)","v":"- Physical environment LTA"},{"$f":"VLOOKUP($C13,'Full Code'!$A$2:$C$221,3,FALSE)","v":"Inadequate equipment controls or control systems [e.g., push-buttons, rotary controls, J-handles, key-operated controls, thumb-wheels, multiple switches, joysticks] contributed to the occurrence. The control failed to provide an adequate range of control for the function it performs. The control was inadequately protected from accidental activation. Similar controls were indistinguishable from one another. Controls were in too close proximity of each other. Operating conditions [e.g. room temperature, work location, physical location, restricted vision, personal protective equipment, excessive noise, arrangement or placement of equipment] affected performance of the task. Lighting was inadequate. Noise was a factor. "}]
["Task Demands","Interpretation requirements","A3B3",{"$f":"VLOOKUP(C14,'Full Code'!$A$2:$B$221,2,FALSE)","v":"KNOWLEDGE BASED ERROR"},{"$f":"VLOOKUP($C14,'Full Code'!$A$2:$C$221,3,FALSE)","v":"The problem was solved without using stored rules for behavior. The involved personnel were in a problem solving/troubleshooting mode. Note: Some people find it easier to think of this node as “Lack of Knowledge Based Error” since the essential gap is experiential. "}]
["Task Demands","Interpretation requirements","A4B1C01",{"$f":"VLOOKUP(C15,'Full Code'!$A$2:$B$221,2,FALSE)","v":"- Management policy guidance / expectations not well-defined, understood or enforced"},{"$f":"VLOOKUP($C15,'Full Code'!$A$2:$C$221,3,FALSE)","v":"Personnel exhibited a lack of understanding of existing policy and/or expectations, or policy/expectations were not well-defined or policy/expectation is not enforced. "}]
{"$rows_left_out":150}
{"sheet":"Error Precursor Selections","index":7,"n_rows":2,"n_cols":1,"rows_kept":2,"cut":false,"hidden":true,"merged":[]}
["Error Precursor Type"]
["Task Demands"]